Skip to content

improvement(knowledge): resolve connector and member state once per search #32220

improvement(knowledge): resolve connector and member state once per search

improvement(knowledge): resolve connector and member state once per search #32220

Triggered via pull request September 19, 2026 22:46
Status Failure
Total duration 3m 0s
Artifacts –

ci.yml

on: pull_request
Detect Version
Detect Version
Detect Desktop Changes
Detect Desktop Changes
Prepare Trigger.dev
Prepare Trigger.dev
Matrix: Build AMD64
Matrix: Build Dev ECR
Matrix: Build ARM64 (GHCR Only)
Matrix: Test and Build / oauth-postgres
Matrix: Test and Build / test-shard
Test and Build  /  Lint and Test
1m 9s
Test and Build / Lint and Test
Test and Build  /  Build App
2m 48s
Test and Build / Build App
Check Docs Changes
Check Docs Changes
Migrate Dev DB  /  Apply Database Migrations
Migrate Dev DB / Apply Database Migrations
Check Desktop Signing Secrets
Check Desktop Signing Secrets
Migrate DB  /  Apply Database Migrations
Migrate DB / Apply Database Migrations
Create Desktop Prerelease
Create Desktop Prerelease
Promote Images
Promote Images
Desktop Prerelease Build  /  Build, Sign, Notarize
Desktop Prerelease Build / Build, Sign, Notarize
Matrix: Create GHCR Manifests
Process Docs  /  Process Documentation Embeddings
Process Docs / Process Documentation Embeddings
Promote Trigger.dev
0s
Promote Trigger.dev
Publish Desktop Prerelease
0s
Publish Desktop Prerelease
Resolve Attestation Subjects
0s
Resolve Attestation Subjects
Prune Desktop Prereleases
0s
Prune Desktop Prereleases
Matrix: Attest Images
Create GitHub Release
0s
Create GitHub Release
Desktop Release  /  Build, Sign, Notarize
Desktop Release / Build, Sign, Notarize
Fit to window
Zoom out
Zoom in

Annotations

8 errors and 13 warnings
Test and Build / Lint and Test
Process completed with exit code 1.
Test and Build / Lint and Test
@sim/db#test: command (/home/runner/_work/sim/sim/packages/db) /home/runner/.bun/bin/bun run test exited (1)
script-migrations-paused-billing-attribution.test.ts > script migration registry > keeps script migrations in append-only order: packages/db/script-migrations-paused-billing-attribution.test.ts#L439
AssertionError: expected [ …(17) ] to deeply equal [ …(16) ] - Expected + Received @@ -13,6 +13,7 @@ "0014_require_knowledge_base_owner", "0016_backfill_search_vectors", "0017_index_search_documents", "0018_repair_workspace_file_content_revision", "0019_tin_keyword_projection", + "0020_document_acl_valid_until", ] ❯ script-migrations-paused-billing-attribution.test.ts:439:65
Test and Build / Lint and Test
Process completed with exit code 1.
Test and Build / PostgreSQL integration (migrate)
Process completed with exit code 1.
script-migrations/0016_backfill_search_vectors.postgres.test.ts > search projection upgrade in PostgreSQL > runs 0016 directly after a partially committed, unjournaled 0015: packages/db/script-migrations/0016_backfill_search_vectors.postgres.test.ts#L388
AssertionError: expected [ …(6) ] to deeply equal [ …(5) ] - Expected + Received @@ -12,6 +12,9 @@ "name": "0018_repair_workspace_file_content_revision", }, { "name": "0019_tin_keyword_projection", }, + { + "name": "0020_document_acl_valid_until", + }, ] ❯ script-migrations/0016_backfill_search_vectors.postgres.test.ts:388:7
Test and Build / PostgreSQL integration (push)
Process completed with exit code 1.
script-migrations/0016_backfill_search_vectors.postgres.test.ts > search projection upgrade in PostgreSQL > runs 0016 directly after a partially committed, unjournaled 0015: packages/db/script-migrations/0016_backfill_search_vectors.postgres.test.ts#L388
AssertionError: expected [ …(6) ] to deeply equal [ …(5) ] - Expected + Received @@ -12,6 +12,9 @@ "name": "0018_repair_workspace_file_content_revision", }, { "name": "0019_tin_keyword_projection", }, + { + "name": "0020_document_acl_valid_until", + }, ] ❯ script-migrations/0016_backfill_search_vectors.postgres.test.ts:388:7
Test and Build / Lint and Test
Skipping sticky disk commit due to previous step failures
Test and Build / Lint and Test
- Step: unknown (failed)
Test and Build / Lint and Test
Found 2 failed/cancelled steps in previous workflow steps
Test and Build / Lint and Test
Skipping sticky disk commit due to previous step failures
Test and Build / Lint and Test
- Step: unknown (failed)
Test and Build / Lint and Test
Found 2 failed/cancelled steps in previous workflow steps
Test and Build / Lint and Test
Skipping sticky disk commit due to previous step failures
Test and Build / Lint and Test
- Step: unknown (failed)
Test and Build / Lint and Test
Found 2 failed/cancelled steps in previous workflow steps
Test and Build / PostgreSQL integration (migrate)
Skipping sticky disk commit due to previous step failures
Test and Build / PostgreSQL integration (migrate)
Found 2 failed/cancelled steps in previous workflow steps
Test and Build / PostgreSQL integration (push)
Skipping sticky disk commit due to previous step failures
Test and Build / PostgreSQL integration (push)
Found 2 failed/cancelled steps in previous workflow steps